BDBM13152 (2S)-1-[(2S)-2-[(2S)-2-aminobutanamido]-3-methylbutanoyl]-N-(diphenylmethyl)pyrrolidine-2-carboxamide::Smac peptido-mimetic 6j
SMILES CC[C@H](N)C(=O)N[C@@H](C(C)C)C(=O)N1CCC[C@H]1C(=O)NC(c1ccccc1)c1ccccc1
InChI Key InChIKey=ZYQRNUJYGVCLAR-VABKMULXSA-N
Data  1 KI
  Tab Delimited (TSV)   2D SDfile   Computed 3D by Vconf -m prep SDfile
Find this compound or compounds like it in BindingDB:
Activity Spreadsheet -- Enzyme Inhibition Constant Data from BindingDB
Found 1 hit for monomerid = 13152
TargetE3 ubiquitin-protein ligase XIAP [241-356](Homo sapiens (Human))
University of Michigan
LigandPNGBDBM13152((2S)-1-[(2S)-2-[(2S)-2-aminobutanamido]-3-methylbu...)
Affinity DataKi:  24nM ΔG°:  -10.3kcal/molepH: 7.5 T: 2°C. Assay description: A quantitative in vitro binding assay using the fluorescence polarization (FP) based method was developed and used to determine the binding affinity ...
In DepthDetails ArticlePubMed